{"text_format":"2","workbook":"xlsx","n_sheets":5,"sheets":["1. Herd Entry","2. Basic calculator","3. DDD DCD","4. Instructions","Sheet 5"],"not_rendered":{"charts":2,"images":2,"macros":1,"external_links":0,"defined_names":14,"comments":2,"pivot_tables":0},"unopened":[],"bounds":{"document_bytes":16777216,"sheet_cells":100000,"run_cost":"one","rows_first":2000,"rows_last":500,"rows_between":2000,"halvings":0,"cell_chars":16384,"cell_head_chars":4096},"cells_cut":0,"cells_raw":0,"read":"whole","date_system":"1900"}

{"sheet":"1. Herd Entry","index":0,"n_rows":16,"n_cols":2,"rows_kept":16,"cut":false,"hidden":false,"merged":[]}
[null,"Number"]
["Dairy cow",100]
["Slaughtered Cow"]
["Slaughtered Heifer"]
["Slaughtered Bullocks and Bulls"]
["Slaughtered Calves and Young Cattle"]
["Total PCU (Kg)",{"$f":"(A12*B2)+(A13*B3)+(A14*B4)+(A15*B5)+(A16*B6)","v":42500}]
[]
[]
[]
["Weight (Kg)"]
[425]
[425]
[200]
[425]
[140]

{"sheet":"2. Basic calculator","index":1,"n_rows":57,"n_cols":10,"rows_kept":57,"cut":false,"hidden":false,"merged":[]}
[{"$nulls":4},"TOTAL","Critical"]
[null,null,"Total mg/PCU in herd",null,{"$f":"(SUM(E7:E57))","v":0.35294117647058826},{"$f":"SUM(J30:J34)","v":0}]
[null,null,"Total DDD",null,{"$f":"'3. DDD DCD'!H7","v":4.2523033309709427E-2},{"$f":"'3. DDD DCD'!I7","v":0}]
[null,null,"Total DCD",null,{"$f":"'3. DDD DCD'!J7","v":1.2170385395537527E-2},{"$f":"'3. DDD DCD'!K7","v":0}]
[]
["Route","Product","Amount used","Units","mg/PCU","Critically important?"]
["Injectable","Betamox 150mg/ml Suspension for Injection",100,{"$f":"IF(B7=\"\",\"\",VLOOKUP(B7,All,9,FALSE))","v":"ml"},{"$f":"IF(B7=\"\",\"\",(C7*(VLOOKUP(B7,All,8,FALSE))/('1. Herd Entry'!$B$7)))","v":0.35294117647058826},{"$f":"IF(B7=\"\",\"\",IF((VLOOKUP(B7,All,7,FALSE)>0),\"CRITICAL\",\"\"))","v":""}]
[null,null,null,"",{"$f":"IF(B8=\"\",\"\",(C8*(VLOOKUP(B8,All,8,FALSE))/('1. Herd Entry'!$B$7)))","v":""},{"$f":"IF(B8=\"\",\"\",IF((VLOOKUP(B8,All,7,FALSE)>0),\"CRITICAL\",\"\"))","v":""}]
[null,null,null,{"$f":"IF(B9=\"\",\"\",VLOOKUP(B9,All,9,FALSE))","v":""},{"$f":"IF(B9=\"\",\"\",(C9*(VLOOKUP(B9,All,8,FALSE))/('1. Herd Entry'!$B$7)))","v":""},{"$f":"IF(B9=\"\",\"\",IF((VLOOKUP(B9,All,7,FALSE)>0),\"CRITICAL\",\"\"))","v":""}]
[null,null,null,"",{"$f":"IF(B10=\"\",\"\",(C10*(VLOOKUP(B10,All,8,FALSE))/('1. Herd Entry'!$B$7)))","v":""},""]
[null,null,null,"",{"$f":"IF(B11=\"\",\"\",(C11*(VLOOKUP(B11,All,8,FALSE))/('1. Herd Entry'!$B$7)))","v":""},""]
[null,null,null,"",{"$f":"IF(B12=\"\",\"\",(C12*(VLOOKUP(B12,All,8,FALSE))/('1. Herd Entry'!$B$7)))","v":""},""]
[null,null,null,"",{"$f":"IF(B13=\"\",\"\",(C13*(VLOOKUP(B13,All,8,FALSE))/('1. Herd Entry'!$B$7)))","v":""},""]
[null,null,null,"",{"$f":"IF(B14=\"\",\"\",(C14*(VLOOKUP(B14,All,8,FALSE))/('1. Herd Entry'!$B$7)))","v":""},""]
[null,null,null,"",{"$f":"IF(B15=\"\",\"\",(C15*(VLOOKUP(B15,All,8,FALSE))/('1. Herd Entry'!$B$7)))","v":""},""]
[null,null,null,"",{"$f":"IF(B16=\"\",\"\",(C16*(VLOOKUP(B16,All,8,FALSE))/('1. Herd Entry'!$B$7)))","v":""},""]
[null,null,null,"",{"$f":"IF(B17=\"\",\"\",(C17*(VLOOKUP(B17,All,8,FALSE))/('1. Herd Entry'!$B$7)))","v":""},""]
[null,null,null,"",{"$f":"IF(B18=\"\",\"\",(C18*(VLOOKUP(B18,All,8,FALSE))/('1. Herd Entry'!$B$7)))","v":""},""]
[null,null,null,"",{"$f":"IF(B19=\"\",\"\",(C19*(VLOOKUP(B19,All,8,FALSE))/('1. Herd Entry'!$B$7)))","v":""},""]
[null,null,null,"",{"$f":"IF(B20=\"\",\"\",(C20*(VLOOKUP(B20,All,8,FALSE))/('1. Herd Entry'!$B$7)))","v":""},""]
{"$rows_left_out":38}
{"sheet":"3. DDD DCD","index":2,"n_rows":86,"n_cols":19,"rows_kept":86,"cut":false,"hidden":false,"merged":[[6,4,6,6],[5,4,5,6],[4,4,4,6],[3,4,3,6],[9,6,9,8],[28,1,28,2],[27,1,27,2],[26,1,26,2],[11,6,11,8],[10,6,10,8],[34,1,34,2],[35,1,35,2],[36,1,36,2],[13,1,13,2],[14,1,14,2],[21,1,21,2],[20,1,20,2],[19,1,19,2],[18,1,18,2],[17,1,17,2],[16,1,16,2],[15,1,15,2],[25,1,25,2],[24,1,24,2],[23,1,23,2],[22,1,22,2],[29,1,29,2],[30,1,30,2],[31,1,31,2],[32,1,32,2],[33,1,33,2],[60,1,60,2],[49,1,49,2],[50,1,50,2],[51,1,51,2],[52,1,52,2],[53,1,53,2],[54,1,54,2],[55,1,55,2],[56,1,56,2],[57,1,57,2],[58,1,58,2],[59,1,59,2],[61,1,61,2],[62,1,62,2],[63,1,63,2],[64,1,64,2],[37,1,37,2],[38,1,38,2],[39,1,39,2],[40,1,40,2],[41,1,41,2],[42,1,42,2],[43,1,43,2],[44,1,44,2],[45,1,45,2],[46,1,46,2],[47,1,47,2],[48,1,48,2]]}
[{"$nulls":7},"DDD","DDDcritical","DCD","DCDcritical"]
[{"$nulls":4},"Injectable per kg",null,null,{"$f":"C71","v":4.2523033309709427E-2},{"$f":"E71","v":0},{"$f":"G71","v":1.2170385395537527E-2},{"$f":"I71","v":0}]
[{"$nulls":4},"Lactatingtube per cow",null,null,{"$f":"D72","v":0},{"$f":"E72","v":0},{"$f":"H72","v":0},{"$f":"I72","v":0}]
[{"$nulls":4},"Drytube per cow",null,null,"NA","NA",{"$f":"H73","v":0},{"$f":"I73","v":0}]
[{"$nulls":4},"Footbath per cow",null,null,{"$f":"D74","v":0},{"$f":"E74","v":0},{"$f":"H74","v":0},{"$f":"I74","v":0}]
[{"$nulls":4},"Other per kg",null,null,{"$f":"C75","v":0},{"$f":"E75","v":0},{"$f":"G75","v":0},{"$f":"I75","v":0}]
[{"$nulls":4},"TOTAL",null,null,{"$f":"H2+H3+H6+H5","v":4.2523033309709427E-2},{"$f":"SUM(I2:I3,I5:I6)","v":0},{"$f":"SUM(J2:J5)","v":1.2170385395537527E-2},{"$f":"SUM(K2:K6)","v":0}]
[]
[]
[{"$nulls":9},"Total","Critical"]
[{"$nulls":6},"Total mg/PCU in herd",null,null,{"$f":"(SUM(G15:G65))","v":0.35294117647058826},{"$f":"SUM(D79:D83)","v":0}]
[{"$nulls":6},"Total DDD",null,null,{"$f":"H7","v":4.2523033309709427E-2},{"$f":"I7","v":0}]
[]
["Route","Product",null,"Amount used","Units","mg","mg/PCU","DDDvet","DCDvet","Per","Critically important?",{"$nulls":5},"DDDvet","DCDvet","per"]
[{"$f":"IF('2. Basic calculator'!A7=\"\",\"\",'2. Basic calculator'!A7)","v":"Injectable"},{"$f":"IF('2. Basic calculator'!B7=\"\",\"\",'2. Basic calculator'!B7)","v":"Betamox 150mg/ml Suspension for Injection"},null,{"$f":"IF('2. Basic calculator'!C7=\"\",\"\",'2. Basic calculator'!C7)","v":100},{"$f":"IF('2. Basic calculator'!D7=\"\",\"\",'2. Basic calculator'!D7)","v":"ml"},{"$f":"IF(B15=\"\",\"\",D15*VLOOKUP(B15,All,8,FALSE))","v":15000},{"$f":"IF('2. Basic calculator'!E7=\"\",\"\",'2. Basic calculator'!E7)","v":0.35294117647058826},{"$f":"IF(A15=\"\",\"\",IF(A15=\"lactatingtube\",D15/Q15/'1. Herd Entry'!$B$2,IF('3. DDD DCD'!A15=\"drytube\",\"\",IF(A15=\"Footbath\",F15/Q15/'1. Herd Entry'!$B$2,IF(B15='Sheet 5'!$A$127,D15/'1. Herd Entry'!$B$2,IF(A15=\"other\",G15/Q15,IF(S15=\"kg\",G15/Q15,\"\")))))))","v":4.2523033309709427E-2},{"$f":"IF(A15=\"\",\"\",IF(A15=\"lactatingtube\",D15/R15/'1. Herd Entry'!$B$2,IF('3. DDD DCD'!A15=\"drytube\",D15/R15/'1. Herd Entry'!$B$2,IF(A15=\"Footbath\",H15,IF(B15='Sheet 5'!$A$127,D15/R15/'1. Herd Entry'!$B$2,IF(A15=\"other\",G15/R15,IF(S15=\"kg\",G15/R15,\"\")))))))","v":1.2170385395537527E-2},{"$f":"IF(A15=\"\",\"\",IF(A15=\"Footbath\",\"Cow\",IF(B15='Sheet 5'!$A$127,\"Cow\",IF(A15=\"other\",\"PCU\",IF(S15=\"kg\",\"PCU\",IF(S15=\"unit\",\"Cow\",\" \"))))))","v":"PCU"},{"$f":"IF(B15=\"\",\"\",IF((VLOOKUP(B15,All,7,FALSE)>0),\"CRITICAL\",\"\"))","v":""},{"$nulls":5},{"$f":"IF(A15=\"\",\"\",VLOOKUP(B15,All,10,FALSE))","v":8.3000000000000007},{"$f":"IF(A15=\"\",\"\",VLOOKUP(B15,All,11,FALSE))","v":29},{"$f":"IF(E15=\"\",\"\",IF(E15=\"ml\",\"kg\",IF(E15=\"grams\",\"kg\",\"unit\")))","v":"kg"}]
[{"$f":"IF('2. Basic calculator'!A8=\"\",\"\",'2. Basic calculator'!A8)","v":""},{"$f":"IF('2. Basic calculator'!B8=\"\",\"\",'2. Basic calculator'!B8)","v":""},null,{"$f":"IF('2. Basic calculator'!C8=\"\",\"\",'2. Basic calculator'!C8)","v":""},{"$f":"IF('2. Basic calculator'!D8=\"\",\"\",'2. Basic calculator'!D8)","v":""},"",{"$f":"IF('2. Basic calculator'!E8=\"\",\"\",'2. Basic calculator'!E8)","v":""},{"$f":"IF(A16=\"\",\"\",IF(A16=\"lactatingtube\",D16/Q16/'1. Herd Entry'!$B$2,IF('3. DDD DCD'!A16=\"drytube\",\"\",IF(A16=\"Footbath\",F16/Q16/'1. Herd Entry'!$B$2,IF(B16='Sheet 5'!$A$127,D16/'1. Herd Entry'!$B$2,IF(A16=\"other\",G16/Q16,IF(S16=\"kg\",G16/Q16,\"\")))))))","v":""},{"$f":"IF(A16=\"\",\"\",IF(A16=\"lactatingtube\",D16/R16/'1. Herd Entry'!$B$2,IF('3. DDD DCD'!A16=\"drytube\",D16/R16/'1. Herd Entry'!$B$2,IF(A16=\"Footbath\",H16,IF(B16='Sheet 5'!$A$127,D16/R16/'1. Herd Entry'!$B$2,IF(A16=\"other\",G16/R16,IF(S16=\"kg\",G16/R16,\"\")))))))","v":""},{"$f":"IF(A16=\"\",\"\",IF(A16=\"Footbath\",\"Cow\",IF(B16='Sheet 5'!$A$127,\"Cow\",IF(A16=\"other\",\"PCU\",IF(S16=\"kg\",\"PCU\",IF(S16=\"unit\",\"Cow\",\" \"))))))","v":""},"",{"$nulls":5},"","",""]
[{"$f":"IF('2. Basic calculator'!A9=\"\",\"\",'2. Basic calculator'!A9)","v":""},{"$f":"IF('2. Basic calculator'!B9=\"\",\"\",'2. Basic calculator'!B9)","v":""},null,{"$f":"IF('2. Basic calculator'!C9=\"\",\"\",'2. Basic calculator'!C9)","v":""},{"$f":"IF('2. Basic calculator'!D9=\"\",\"\",'2. Basic calculator'!D9)","v":""},"",{"$f":"IF('2. Basic calculator'!E9=\"\",\"\",'2. Basic calculator'!E9)","v":""},{"$f":"IF(A17=\"\",\"\",IF(A17=\"lactatingtube\",D17/Q17/'1. Herd Entry'!$B$2,IF('3. DDD DCD'!A17=\"drytube\",\"\",IF(A17=\"Footbath\",F17/Q17/'1. Herd Entry'!$B$2,IF(B17='Sheet 5'!$A$127,D17/'1. Herd Entry'!$B$2,IF(A17=\"other\",G17/Q17,IF(S17=\"kg\",G17/Q17,\"\")))))))","v":""},{"$f":"IF(A17=\"\",\"\",IF(A17=\"lactatingtube\",D17/R17/'1. Herd Entry'!$B$2,IF('3. DDD DCD'!A17=\"drytube\",D17/R17/'1. Herd Entry'!$B$2,IF(A17=\"Footbath\",H17,IF(B17='Sheet 5'!$A$127,D17/R17/'1. Herd Entry'!$B$2,IF(A17=\"other\",G17/R17,IF(S17=\"kg\",G17/R17,\"\")))))))","v":""},{"$f":"IF(A17=\"\",\"\",IF(A17=\"Footbath\",\"Cow\",IF(B17='Sheet 5'!$A$127,\"Cow\",IF(A17=\"other\",\"PCU\",IF(S17=\"kg\",\"PCU\",IF(S17=\"unit\",\"Cow\",\" \"))))))","v":""},"",{"$nulls":5},"","",{"$f":"IF(E17=\"\",\"\",IF(E17=\"ml\",\"kg\",IF(E17=\"grams\",\"kg\",\"unit\")))","v":""}]
[{"$f":"IF('2. Basic calculator'!A10=\"\",\"\",'2. Basic calculator'!A10)","v":""},{"$f":"IF('2. Basic calculator'!B10=\"\",\"\",'2. Basic calculator'!B10)","v":""},null,{"$f":"IF('2. Basic calculator'!C10=\"\",\"\",'2. Basic calculator'!C10)","v":""},{"$f":"IF('2. Basic calculator'!D10=\"\",\"\",'2. Basic calculator'!D10)","v":""},"",{"$f":"IF('2. Basic calculator'!E10=\"\",\"\",'2. Basic calculator'!E10)","v":""},{"$f":"IF(A18=\"\",\"\",IF(A18=\"lactatingtube\",D18/Q18/'1. Herd Entry'!$B$2,IF('3. DDD DCD'!A18=\"drytube\",\"\",IF(A18=\"Footbath\",F18/Q18/'1. Herd Entry'!$B$2,IF(B18='Sheet 5'!$A$127,D18/'1. Herd Entry'!$B$2,IF(A18=\"other\",G18/Q18,IF(S18=\"kg\",G18/Q18,\"\")))))))","v":""},{"$f":"IF(A18=\"\",\"\",IF(A18=\"lactatingtube\",D18/R18/'1. Herd Entry'!$B$2,IF('3. DDD DCD'!A18=\"drytube\",D18/R18/'1. Herd Entry'!$B$2,IF(A18=\"Footbath\",H18,IF(B18='Sheet 5'!$A$127,D18/R18/'1. Herd Entry'!$B$2,IF(A18=\"other\",G18/R18,IF(S18=\"kg\",G18/R18,\"\")))))))","v":""},{"$f":"IF(A18=\"\",\"\",IF(A18=\"Footbath\",\"Cow\",IF(B18='Sheet 5'!$A$127,\"Cow\",IF(A18=\"other\",\"PCU\",IF(S18=\"kg\",\"PCU\",IF(S18=\"unit\",\"Cow\",\" \"))))))","v":""},"",{"$nulls":5},"","",""]
[{"$f":"IF('2. Basic calculator'!A11=\"\",\"\",'2. Basic calculator'!A11)","v":""},{"$f":"IF('2. Basic calculator'!B11=\"\",\"\",'2. Basic calculator'!B11)","v":""},null,{"$f":"IF('2. Basic calculator'!C11=\"\",\"\",'2. Basic calculator'!C11)","v":""},{"$f":"IF('2. Basic calculator'!D11=\"\",\"\",'2. Basic calculator'!D11)","v":""},"",{"$f":"IF('2. Basic calculator'!E11=\"\",\"\",'2. Basic calculator'!E11)","v":""},{"$f":"IF(A19=\"\",\"\",IF(A19=\"lactatingtube\",D19/Q19/'1. Herd Entry'!$B$2,IF('3. DDD DCD'!A19=\"drytube\",\"\",IF(A19=\"Footbath\",F19/Q19/'1. Herd Entry'!$B$2,IF(B19='Sheet 5'!$A$127,D19/'1. Herd Entry'!$B$2,IF(A19=\"other\",G19/Q19,IF(S19=\"kg\",G19/Q19,\"\")))))))","v":""},{"$f":"IF(A19=\"\",\"\",IF(A19=\"lactatingtube\",D19/R19/'1. Herd Entry'!$B$2,IF('3. DDD DCD'!A19=\"drytube\",D19/R19/'1. Herd Entry'!$B$2,IF(A19=\"Footbath\",H19,IF(B19='Sheet 5'!$A$127,D19/R19/'1. Herd Entry'!$B$2,IF(A19=\"other\",G19/R19,IF(S19=\"kg\",G19/R19,\"\")))))))","v":""},{"$f":"IF(A19=\"\",\"\",IF(A19=\"Footbath\",\"Cow\",IF(B19='Sheet 5'!$A$127,\"Cow\",IF(A19=\"other\",\"PCU\",IF(S19=\"kg\",\"PCU\",IF(S19=\"unit\",\"Cow\",\" \"))))))","v":""},"",{"$nulls":5},"","",""]
[{"$f":"IF('2. Basic calculator'!A12=\"\",\"\",'2. Basic calculator'!A12)","v":""},{"$f":"IF('2. Basic calculator'!B12=\"\",\"\",'2. Basic calculator'!B12)","v":""},null,{"$f":"IF('2. Basic calculator'!C12=\"\",\"\",'2. Basic calculator'!C12)","v":""},{"$f":"IF('2. Basic calculator'!D12=\"\",\"\",'2. Basic calculator'!D12)","v":""},"",{"$f":"IF('2. Basic calculator'!E12=\"\",\"\",'2. Basic calculator'!E12)","v":""},{"$f":"IF(A20=\"\",\"\",IF(A20=\"lactatingtube\",D20/Q20/'1. Herd Entry'!$B$2,IF('3. DDD DCD'!A20=\"drytube\",\"\",IF(A20=\"Footbath\",F20/Q20/'1. Herd Entry'!$B$2,IF(B20='Sheet 5'!$A$127,D20/'1. Herd Entry'!$B$2,IF(A20=\"other\",G20/Q20,IF(S20=\"kg\",G20/Q20,\"\")))))))","v":""},{"$f":"IF(A20=\"\",\"\",IF(A20=\"lactatingtube\",D20/R20/'1. Herd Entry'!$B$2,IF('3. DDD DCD'!A20=\"drytube\",D20/R20/'1. Herd Entry'!$B$2,IF(A20=\"Footbath\",H20,IF(B20='Sheet 5'!$A$127,D20/R20/'1. Herd Entry'!$B$2,IF(A20=\"other\",G20/R20,IF(S20=\"kg\",G20/R20,\"\")))))))","v":""},{"$f":"IF(A20=\"\",\"\",IF(A20=\"Footbath\",\"Cow\",IF(B20='Sheet 5'!$A$127,\"Cow\",IF(A20=\"other\",\"PCU\",IF(S20=\"kg\",\"PCU\",IF(S20=\"unit\",\"Cow\",\" \"))))))","v":""},"",{"$nulls":5},"","",""]
{"$rows_left_out":67}
{"sheet":"4. Instructions","index":3,"n_rows":49,"n_cols":3,"rows_kept":49,"cut":false,"hidden":false,"merged":[]}
["University of Nottingham Dairy AMU Calculator 4.12"]
["Disclaimer: Please note, use of this calculator is at the users own risk "]
["Instructions"]
["This calculator is designed to provide an estimation of antimicrobial usage on farms using standard EMA/ESVAC "]
["methodology. There are various caveats to using either mg/PCU (population correction unit), DDD (defined daily dose), "]
["or DCD (defined course dose) methods, and this tool aims to highlight the major differences between the systems"]
[]
["Mg/PCU describes the mass of antibiotics used on a farm in relation to the overall mass of animals on a farm"]
["DDD describes the number of equivalent doses of antibiotic per animal or Kg on a farm"]
["DCD describes the number of equivalent courses of an antibiotic per animal or Kg on a farm"]
[]
["Enter farm details by clicking: "]
["Dairy farms calculating mg/PCU or CHAWG metrics should enter adult dairy cow numbers ONLY. "]
[]
["Enter all antimicrobials used on the farm over a twelve month period (including adult and dairy/dairy cross youngstock)"]
["Select a ROUTE, PRODUCT and AMOUNT of drug used by clicking: "]
["Amount used will be presented in mls, tubes, grams or units"]
["PCU (Population corrected unit) is calculated from herd entry figures, and is based on EMA/ESVAC standard weights "]
["(these weights are designed to be used at a national level, and are not always appropriate for farm level comparision)"]
["mg of product per Kg PCU is presented, including a separate figure for critically important antibiotics"]
{"$rows_left_out":30}
{"sheet":"Sheet 5","index":4,"n_rows":143,"n_cols":24,"rows_kept":143,"cut":false,"hidden":false,"merged":[]}
["Drug","Active","Route","Dose mg/kg (or mg/tube)","treatments (days/tubes)","Dose per Tx","Critical","mg/unit","Units","DDD","DCD",null,"Route"]
["Bovaclox DC Intramammary Suspen","Cloxacillin","DCT",750,1,{"$f":"D2","v":750},0,750,"Tubes",null,4,null,"Injectable"]
["Bovaclox DC Xtra Intramammary Suspension","Cloxacillin","DCT",900,1,900,0,900,"Tubes",null,4,null,"Lactatingtube"]
["Cefimam DC","Cefquinome","DCT",150,1,150,1,150,"Tubes",null,4,null,"Drytube"]
["Cefshot DC 250mg Intramammary Suspension for Cattle","Cephalonium","DCT",250,1,250,0,250,"Tubes",null,4,null,"Footbath"]
["Cephaguard DC 150 mg intramammary ointment","Cefquinome","DCT",150,1,{"$f":"D6","v":150},1,150,"Tubes",null,4,null,"Other"]
["Cepravin Dry Cow 250 mg Intramammary suspension","Cephalonium","DCT",250,1,250,0,250,"Tubes",null,4]
["Multishield DC","Neomycin Sulphate","DCT",600,1,600,0,404.4,"Tubes",null,4,"From VMD (penthamate)"]
["Noroclox DC 500mg Intramammary Suspension","Cloxacillin","DCT",500,1,500,0,500,"Tubes",null,4]
["Orbenin Dry Cow 500 mg Intramammary Suspension","Cloxacillin Benzathine","DCT",500,1,500,0,500,"Tubes",null,4]
["Orbenin Extra Dry Cow 600 mg Intramammary Suspension","Cloxacillin Benzathine","DCT",600,1,600,0,600,"Tubes",null,4]
["Ubro Red Dry Cow","Framycetin Sulfate","DCT",500,1,500,0,346,"Tubes",null,4,"From VMD"]
["Ubrostar Red 100 mg / 280 mg / 100 mg Intramammary Suspension for cattle","Penethamate hydroiodide","DCT",null,null,319.8,0,319.8,"Tubes",null,4]
["Linco-Spectin 100, 222/444.7 mg/g Powder for use in drinking water for pigs & chickens","Lincomycin","Footbath",64470.000000000007,1,{"$f":"D14","v":64470.000000000007},0,644.70000000000005,"grams",{"$f":"H14","v":644.70000000000005},{"$f":"H14","v":644.70000000000005},"Poultry"]
["Linco-Sol 400mg/g powder Footbath","Lincomycin","Footbath",400000,1,400000,0,400,"grams",400,400,"Poultry"]
["Tylan Soluble Powder for Oral Solution Footbath","Tylosin","Footbath",100000,1,{"$f":"D16","v":100000},0,1000,"grams",{"$f":"H16","v":1000},{"$f":"H16","v":1000},"Poultry"]
["Albiotic 330mg/100mg Intramammary Solution","Lincomycin","IMM",430,3,{"$f":"D17","v":430},0,430,"Tubes",1,3]
["Ceffect LC, 75mg, Intramammary Ointment for Lactating Cows","Cefquinome","IMM",75,3,75,1,75,"Tubes",1,3,{"$nulls":5},"Drug","Active","Route","g/ml/tubes","TOTAL mg/ml","Act 1mg/ml (or mg/tube)","Dose mg/kg (or mg/tube)","treatments (days/tubes)"]
["Cefimam LC, 75mg Intramammary Ointment for Lactating Cows","Cefquinome","IMM",75,3,{"$f":"D19","v":75},1,75,"Tubes",1,3,{"$nulls":5},"Ceffect LC, 75mg, Intramammary Ointment for Lactating Cows","Cefquinome","IMM","Tubes",75,75]
["Cobactan MC Intramammary suspension 75 mg Milking cow","Cefquinome","IMM",75,3,75,1,75,"Tubes",1,3]
{"$rows_left_out":123}